[Bug 963] Problem compiling openssh 3.9p1

bugzilla-daemon at mindrot.org bugzilla-daemon at mindrot.org
Tue Dec 14 07:35:24 EST 2004


           Summary: Problem compiling openssh 3.9p1
           Product: Portable OpenSSH
           Version: 3.9p1
          Platform: All
        OS/Version: Linux
            Status: NEW
          Severity: normal
          Priority: P2
         Component: Build system
        AssignedTo: openssh-bugs at mindrot.org
        ReportedBy: pierre42d at 9online.fr

# make
(cd openbsd-compat && make)
make[1]: Entering directory `/tmp/openssh-3.9p1/openbsd-compat'
gcc -s -O3 -march=i686 -Wall -Wpointer-arith -Wno-uninitialized -I. -I.. -I.
-I./..  -I/usr/local/include -I/usr/local/include -DHAVE_CONFIG_H -c
port-aix.cIn file included from port-aix.c:27:
../auth.h:39:22: bsd_auth.h: No such file or directory
In file included from port-aix.c:27:
../auth.h:62: error: parse error before "auth_session_t"
../auth.h:62: warning: no semicolon at end of struct or union
../auth.h:72: error: parse error before '}' token
make[1]: *** [port-aix.o] Error 1
make[1]: Leaving directory `/tmp/openssh-3.9p1/openbsd-compat'
make: *** [openbsd-compat/libopenbsd-compat.a] Error 2

------- You are receiving this mail because: -------
You are the assignee for the bug, or are watching the assignee.

More information about the openssh-bugs mailing list